$# LS-DYNA Keyword file created by LS-PrePost(R) V4.8.30 - 20Apr2022
$# Created on Feb-6-2023 (10:14:51)
$$ HM_OUTPUT_DECK created 09:20:29 09-01-2021 by HyperMesh Version 2021.0.0.33
$$ Ls-dyna Input Deck Generated by HyperMesh Version  : 2021.0.0.33
$$ Generated using HyperMesh-Ls-dyna 971_R12.0 Template Version : 2021.0.0.33
*KEYWORD
$---+----1----+----2----+----3----+----4----+----5----+----6----+----7----+----8
$ UNIT SYSTEM : MM, TON, SEC, N
$---+----1----+----2----+----3----+----4----+----5----+----6----+----7----+----8
*PARAMETER
$    PRMR1      VAL1     PRMR2      VAL2     PRMR3      VAL3     PRMR4      VAL4
$   GLOBAL              MODELL                 FEM             THERMAL
$#   prmr1      val1     prmr2      val2     prmr3      val3     prmr4      val4
R       T 0.10      R  PLTTHK 1.0       R   DT2MS -1.0E-00  R     TSF 1.0
R      FS 0.35      R WZGTHK1 1.0       R  ELFORM 2         R  TBLANK 22.0
R  D3PLOT 350       R WZGTHK2 0.0       R    IGAP 2         R  KELVIN 273.15
                    R   ZDIS2 0.0                           R     SBC 5.67E-11
                    R   ZDIS3 0.0
                    R   ZINIT 0.0
                    R   YINIT 0.0
                    R  VCLOSE 0.0
*PARAMETER_EXPRESSION
$     PRMR  EXPRESSION
R  vDfzDC 2.5
R  vDkzDC 0.62
R   vD0DC 0.55
R  vD20DC 3.0
R  kDfzDC 0.28
R  kDkzDC 0.13
R   kD0DC 1.8
R  kD20DC 3.0
R TBLANKK TBLANK + KELVIN
R HPLTTHK PLTTHK * 0.75
$     PRMR  EXPRESSION
$     PRMR  EXPRESSION
$     PRMR  EXPRESSION
$     PRMR  EXPRESSION
$     PRMR  EXPRESSION
$     PRMR  EXPRESSION
$     PRMR  EXPRESSION
$     PRMR  EXPRESSION
$     PRMR  EXPRESSION
$     PRMR  EXPRESSION
$     PRMR  EXPRESSION
$     PRMR  EXPRESSION
$     PRMR  EXPRESSION
$     PRMR  EXPRESSION
$     PRMR  EXPRESSION
$     PRMR  EXPRESSION
$     PRMR  EXPRESSION
$     PRMR  EXPRESSION
$     PRMR  EXPRESSION
$     PRMR  EXPRESSION
$     PRMR  EXPRESSION
$     PRMR  EXPRESSION
$     PRMR  EXPRESSION
$     PRMR  EXPRESSION
$     PRMR  EXPRESSION
$     PRMR  EXPRESSION
$     PRMR  EXPRESSION
$     PRMR  EXPRESSION
$     PRMR  EXPRESSION
$     PRMR  EXPRESSION
$     PRMR  EXPRESSION
$     PRMR  EXPRESSION
$     PRMR  EXPRESSION
$     PRMR  EXPRESSION
$     PRMR  EXPRESSION
$     PRMR  EXPRESSION
$     PRMR  EXPRESSION
$     PRMR  EXPRESSION
$     PRMR  EXPRESSION
$     PRMR  EXPRESSION
$     PRMR  EXPRESSION
$     PRMR  EXPRESSION
$     PRMR  EXPRESSION
$     PRMR  EXPRESSION
$     PRMR  EXPRESSION
$     PRMR  EXPRESSION
$     PRMR  EXPRESSION
$     PRMR  EXPRESSION
$     PRMR  EXPRESSION
$     PRMR  EXPRESSION
$     PRMR  EXPRESSION
$     PRMR  EXPRESSION
$     PRMR  EXPRESSION
$     PRMR  EXPRESSION
$     PRMR  EXPRESSION
$     PRMR  EXPRESSION
$     PRMR  EXPRESSION
$     PRMR  EXPRESSION
$     PRMR  EXPRESSION
*TITLE
$#                                                                         title
HG-Werte deep drawing
*DEFINE_CURVE_TITLE
Versagenskurve_DC
$     LCID      SIDR      SCLA      SCLO      OFFA      OFFO    DATTYP
$#    lcid      sidr       sfa       sfo      offa      offo    dattyp     lcint
$                 A1                  O1
$#                a1                  o1
               -0.66&vd20dc
                 0.0&vd20dc
                 0.1&vd0dc
                0.33&vdfzdc
                0.55&vdkzdc
                0.66&vdkzdc
*DEFINE_CURVE_TITLE
kritische Dehnungskurve_DC
$     LCID      SIDR      SCLA      SCLO      OFFA      OFFO    DATTYP
$#    lcid      sidr       sfa       sfo      offa      offo    dattyp     lcint
$                 A1                  O1
$#                a1                  o1
               -0.66&kd20dc
                 0.0&kd20dc
                 0.1&kd0dc
                0.33&kdfzdc
                0.55&kdkzdc
                0.66&kdkzdc
*DEFINE_TABLE_2D
$#    tbid       sfa      offa
       200&tsf             0.0
$#             value                lcid
*DEFINE_CURVE
$  0,0 s-1
$     LCID      SIDR       SFA       SFO      OFFA      OFFO    DATTYP
$#    lcid      sidr       sfa       sfo      offa      offo    dattyp     lcint
$                 A1                  O1
$#                a1                  o1
*DEFINE_CURVE
$  0,01 s-1
$     LCID      SIDR       SFA       SFO      OFFA      OFFO    DATTYP
$#    lcid      sidr       sfa       sfo      offa      offo    dattyp     lcint
$                 A1                  O1
$#                a1                  o1
*DEFINE_CURVE
$  0,03 s-1
$     LCID      SIDR       SFA       SFO      OFFA      OFFO    DATTYP
$#    lcid      sidr       sfa       sfo      offa      offo    dattyp     lcint
$                 A1                  O1
$#                a1                  o1
*DEFINE_CURVE
$  0,08 s-1
$     LCID      SIDR       SFA       SFO      OFFA      OFFO    DATTYP
$#    lcid      sidr       sfa       sfo      offa      offo    dattyp     lcint
$                 A1                  O1
$#                a1                  o1
*DEFINE_CURVE
$  0,4 s-1
$     LCID      SIDR       SFA       SFO      OFFA      OFFO    DATTYP
$#    lcid      sidr       sfa       sfo      offa      offo    dattyp     lcint
$                 A1                  O1
$#                a1                  o1
*DEFINE_CURVE
$  1,0 s-1
$     LCID      SIDR       SFA       SFO      OFFA      OFFO    DATTYP
$#    lcid      sidr       sfa       sfo      offa      offo    dattyp     lcint
$                 A1                  O1
$#                a1                  o1
*DEFINE_CURVE
$  4,0 s-1
$     LCID      SIDR       SFA       SFO      OFFA      OFFO    DATTYP
$#    lcid      sidr       sfa       sfo      offa      offo    dattyp     lcint
$                 A1                  O1
$#                a1                  o1
*DEFINE_CURVE
$ 10,0 s-1
$     LCID      SIDR       SFA       SFO      OFFA      OFFO    DATTYP
$#    lcid      sidr       sfa       sfo      offa      offo    dattyp     lcint
$                 A1                  O1
$#                a1                  o1
*DEFINE_CURVE
$ 30,0 s-1
$     LCID      SIDR       SFA       SFO      OFFA      OFFO    DATTYP
$#    lcid      sidr       sfa       sfo      offa      offo    dattyp     lcint
$                 A1                  O1
$#                a1                  o1
*DEFINE_CURVE
$  60,0 s-1
$     LCID      SIDR       SFA       SFO      OFFA      OFFO    DATTYP
$#    lcid      sidr       sfa       sfo      offa      offo    dattyp     lcint
$                 A1                  O1
$#                a1                  o1
*DEFINE_CURVE
$ 100,0 s-1
$     LCID      SIDR       SFA       SFO      OFFA      OFFO    DATTYP
$#    lcid      sidr       sfa       sfo      offa      offo    dattyp     lcint
$                 A1                  O1
$#                a1                  o1
*DEFINE_CURVE
$180,0 s-1
$     LCID      SIDR       SFA       SFO      OFFA      OFFO    DATTYP
$#    lcid      sidr       sfa       sfo      offa      offo    dattyp     lcint
$                 A1                  O1
$#                a1                  o1
*DEFINE_CURVE
$ 300,0 s-1
$     LCID      SIDR       SFA       SFO      OFFA      OFFO    DATTYP
$#    lcid      sidr       sfa       sfo      offa      offo    dattyp     lcint
$                 A1                  O1
$#                a1                  o1
*DEFINE_CURVE
$ 500,0 s-1
$     LCID      SIDR       SFA       SFO      OFFA      OFFO    DATTYP
$#    lcid      sidr       sfa       sfo      offa      offo    dattyp     lcint
$                 A1                  O1
$#                a1                  o1
*DEFINE_CURVE
$ 1000,0 s-1
$     LCID      SIDR       SFA       SFO      OFFA      OFFO    DATTYP
$#    lcid      sidr       sfa       sfo      offa      offo    dattyp     lcint
$                 A1                  O1
$#                a1                  o1
*DEFINE_CURVE
$2000,0 s-1
$     LCID      SIDR       SFA       SFO      OFFA      OFFO    DATTYP
$#    lcid      sidr       sfa       sfo      offa      offo    dattyp     lcint
$                 A1                  O1
$#                a1                  o1
*MAT_ADD_EROSION_TITLE
GISSMO
$#     mid      excl    mxpres     mneps    effeps    voleps    numfip       ncs
$#  mnpres     sigp1     sigvm     mxeps     epssh     sigth   impulse    failtm
$#    idam    dmgtyp     lcsdg     ecrit    dmgexp     dcrit    fadexp    lcregd
$#  sizflg     refsz     nahsv     lcsrs      shrf     biaxf    lcdlim   midfail
$#   lcfld             epsthin    engcrt    radcrt
*MAT_PIECEWISE_LINEAR_PLASTICITY_TITLE
DC06
$#     mid        ro         e        pr      sigy      etan      fail      tdel
$#       c         p      lcss      lcsr        vp
$#    eps1      eps2      eps3      eps4      eps5      eps6      eps7      eps8
$#     es1       es2       es3       es4       es5       es6       es7       es8
*MAT_RIGID_TITLE
punch constraint
$#     mid        ro         e        pr         n    couple         m     alias
$#     cmo      con1      con2
$#lco or a1        a2        a3        v1        v2        v3
*MAT_RIGID_TITLE
tool constraint
$#     mid        ro         e        pr         n    couple         m     alias
$#     cmo      con1      con2
$#lco or a1        a2        a3        v1        v2        v3
*MAT_THERMAL_ISOTROPIC_TD_TITLE
blank thermal
$#    tmid       tro     tgrlc    tgmult      tlat      hlat
$#      t1        t2        t3        t4        t5        t6        t7        t8
$#      c1        c2        c3        c4        c5        c6        c7        c8
$#      k1        k2        k3        k4        k5        k6        k7        k8
*END